cardinality: 1

AirData ontology (v1) —
type: Ontology
version info: 1.15.0

ATMFuelBurnKPI
type: Class
subclass of: FuelEfficiencyKPI

ArrivalPerformanceKPI
type: Class
subclass of: Performance

END
type: NamedIndividual

MID
type: NamedIndividual

TDZ
type: NamedIndividual

DOWN
type: NamedIndividual

NC
type: NamedIndividual

UP
type: NamedIndividual

UTC
type: NamedIndividual

UTC-3
type: NamedIndividual

DataSource
type: Class

DeparturePerformanceKPI
type: Class
comment: Agrupa os indicadores relacionados às operações de partida do voo.
subclass of: Performance

EnRoutePerformanceKPI
type: Class
subclass of: Performance

FuelEfficiencyKPI
type: Class
subclass of: Performance

GateArrivalOnTimeKPI
type: Class
subclass of: ArrivalPerformanceKPI

GateDepartureOnTimeKPI
type: Class
subclass of: DeparturePerformanceKPI

Operation
type: Class

Performance
type: Class
comment: Representa os indicadores-chave de desempenho (KPIs) definidos pela ICAO...
subclass of: Thing

METAR
type: NamedIndividual

RouteDistanceEfficiencyKPI
type: Class
subclass of: EnRoutePerformanceKPI

TaxilnEfficiencyKPI
type: Class
subclass of: ArrivalPerformanceKPI

TerminalAirspaceEfficiencyKPI
type: Class
subclass of: EnRoutePerformanceKPI

TemporalEvent
type: Class

TopOfClimbEfficiencyKPI
type: Class
subclass of: VerticalEfficiencyKPI

TopOfDescentEfficiencyKPI
type: Class
subclass of: VerticalEfficiencyKPI

VerticalEfficiencyKPI
type: Class
subclass of: Performance

WeatherCondition
type: Class

actualArrivalTime
type: DatatypeProperty
type: FunctionalProperty
comment: arr Portuguese: Data e hora do pouso
sub property of: arrivalEventData

actualInBlockTime
type: DatatypeProperty
comment: cpos Portuguese: Horário Real de Entrada no Gate
sub property of: arrivalEventData

actualLineUpTime
type: DatatypeProperty
comment: crwy Portuguese: Autorização de Ingresso na Cabeceira
sub property of: departureEventData

actualOffBlockTime
type: DatatypeProperty
comment: cpush Horário Real de Saída
sub property of: departureEventData

actualTakeoffTime
type: DatatypeProperty
comment: dep Portuguese: Decolagem
sub property of: departureEventData

actualTaxiStartTime
type: DatatypeProperty
comment: taxi Portuguese: Autorização do taxi
sub property of: departureEventData

estimatedArrivalTime
type: DatatypeProperty
type: FunctionalProperty
comment: eta Portuguese: Último Horário Estimado de Pouso
sub property of: arrivalEventData

estimatedOffBlockTime
type: DatatypeProperty
comment: eobt Portuguese: Último Horário Estimado de Saída
sub property of: departureEventData

holdTime
type: DatatypeProperty
comment: hold Portuguese: Chegada no ponto de espera
sub property of: departureEventData

requestedPushbackTime
type: DatatypeProperty
comment: wpush Portuguese: Solicitação do Hórário Real de Saída
sub property of: departureEventData

requestedTakeoffTime
type: DatatypeProperty
comment: cdep Portuguese: Solicitação de Decolagem
sub property of: departureEventData

requestedTaxiTime
type: DatatypeProperty
comment: wtaxi Portuguese: Solicitação de autorização para início de taxi
sub property of: departureEventData