AirData ontology (v1) —
type: Ontology
version info: 1.15.0

actualArrivalTime
type: DatatypeProperty
sub property of: arrivalEventData
type: FunctionalProperty
comment: arr Portuguese: Data e hora do pouso

actualInBlockTime
type: DatatypeProperty
sub property of: arrivalEventData
comment: cpos Portuguese: Horário Real de Entrada no Gate

actualLineUpTime
type: DatatypeProperty
sub property of: departureEventData
comment: crwy Portuguese: Autorização de Ingresso na Cabeceira

actualOffBlockTime
type: DatatypeProperty
sub property of: departureEventData
comment: cpush Horário Real de Saída

actualTakeoffTime
type: DatatypeProperty
sub property of: departureEventData
comment: dep Portuguese: Decolagem

actualTaxiStartTime
type: DatatypeProperty
sub property of: departureEventData
comment: taxi Portuguese: Autorização do taxi

estimatedArrivalTime
type: DatatypeProperty
sub property of: arrivalEventData
type: FunctionalProperty
comment: eta Portuguese: Último Horário Estimado de Pouso

estimatedOffBlockTime
type: DatatypeProperty
sub property of: departureEventData
comment: eobt Portuguese: Último Horário Estimado de Saída

holdTime
type: DatatypeProperty
sub property of: departureEventData
comment: hold Portuguese: Chegada no ponto de espera

requestedPushbackTime
type: DatatypeProperty
sub property of: departureEventData
comment: wpush Portuguese: Solicitação do Hórário Real de Saída

requestedTakeoffTime
type: DatatypeProperty
sub property of: departureEventData
comment: cdep Portuguese: Solicitação de Decolagem

requestedTaxiTime
type: DatatypeProperty
sub property of: departureEventData
comment: wtaxi Portuguese: Solicitação de autorização para início de taxi

ATMFuelBurnKPI
type: Class
subclass of: FuelEfficiencyKPI

ArrivalPerformanceKPI
type: Class
subclass of: Performance

DataSource
type: Class

DeparturePerformanceKPI
type: Class
subclass of: Performance
comment: Agrupa os indicadores relacionados às operações de partida do voo.

EnRoutePerformanceKPI
type: Class
subclass of: Performance

FuelEfficiencyKPI
type: Class
subclass of: Performance

GateArrivalOnTimeKPI
type: Class
subclass of: ArrivalPerformanceKPI

GateDepartureOnTimeKPI
type: Class
subclass of: DeparturePerformanceKPI

Operation
type: Class

Performance
type: Class
subclass of: Thing
comment: Representa os indicadores-chave de desempenho (KPIs) definidos pela ICAO...

RouteDistanceEfficiencyKPI
type: Class
subclass of: EnRoutePerformanceKPI

TaxilnEfficiencyKPI
type: Class
subclass of: ArrivalPerformanceKPI

TerminalAirspaceEfficiencyKPI
type: Class
subclass of: EnRoutePerformanceKPI

TemporalEvent
type: Class

TopOfClimbEfficiencyKPI
type: Class
subclass of: VerticalEfficiencyKPI

TopOfDescentEfficiencyKPI
type: Class
subclass of: VerticalEfficiencyKPI

VerticalEfficiencyKPI
type: Class
subclass of: Performance

WeatherCondition
type: Class

END
type: NamedIndividual

MID
type: NamedIndividual

TDZ
type: NamedIndividual

DOWN
type: NamedIndividual

NC
type: NamedIndividual

UP
type: NamedIndividual

UTC
type: NamedIndividual

UTC-3
type: NamedIndividual

METAR
type: NamedIndividual

cardinality: 1